{"text_format":"1","workbook":"xlsx","n_sheets":6,"sheets":["Source Data","Equipment Costs","Labor Rates","Reclamation Material Costs","Misc. Unit Costs","Indirect Costs"],"not_rendered":{"charts":0,"images":0,"macros":1,"external_links":2,"defined_names":66,"comments":0,"pivot_tables":0},"unopened":[],"bounds":{"document_bytes":16777216,"sheet_cells":100000,"rows_first":2000,"rows_last":500,"rows_between":2000,"halvings":0,"cell_chars":16384,"cell_head_chars":4096},"cells_cut":0,"cells_raw":0,"read":"whole","date_system":"1900"}

{"sheet":"Source Data","index":0,"n_rows":28,"n_cols":55,"rows_kept":28,"cut":false,"hidden":false,"merged":[]}
["Format Version:",{"$f":"Validity","v":"SRCE Data File v2.0"},null,null,null,null,null,null,null,null,null,null,null,null,null,null,null,null,null,null,null,null,null,null,null,null,null,null,null,null,null,null,null,null,null,null,null,null,null,null,null,null,null,null,null,null,null,null,null,null,null,null,"SRCE Data File v2.0"]
["File Name:",{"$f":"MID(CELL(\"filename\",BB3),FIND(\"[\",CELL(\"filename\",BB3))+1,FIND(\"]\",CELL(\"filename\",BB3),FIND(\"[\",CELL(\"filename\",BB3))+1)-FIND(\"[\",CELL(\"filename\",BB3))-1)","v":"SRCE_2.0_CostDataFile_USR_Example.xlsm"}]
["Date:","2008-09-29"]
["Cost Type:","User Data"]
["Author/Source:","AB Consulting"]
[]
[null,null,null,null,null,null,null,null,null,null,null,null,null,null,null,null,null,null,null,null,null,null,null,null,null,null,null,null,null,null,null,null,null,null,null,null,null,null,null,null,null,null,null,null,null,null,null,null,null,null,null,null,null,null,"Metric?"]
["Units of Measure:","Metric",{"$f":"IF(ISBLANK(B8),\"  <<< Select Units of Measure\",\"\")","v":""},null,null,null,null,null,null,null,null,null,null,null,null,null,null,null,null,null,null,null,null,null,null,null,null,null,null,null,null,null,null,null,null,null,null,null,null,null,null,null,null,null,null,null,null,null,null,null,null,null,null,"Units of Measure:",{"$f":"IF(B8=\"Metric\",TRUE,FALSE)","v":true}]
[null,null,null,"Currently set at NDEP9397"]
[]
["No. of Bases/Regions:",{"$f":"COUNTA(Regions)","v":2}]
[]
["Basis/Region","Basis/Region Name","Basis/Region Description"]
["Basis 1","WA ARO","Western AUS Contractor Rates"]
["Basis 2","WA LOM - site costs","Western AUS Site Rates"]
["Basis 3"]
["Basis 4"]
["Basis 5"]
["Basis 6"]
["Basis 7"]
["Basis 8"]
["Basis 9"]
["Basis 10"]
["Basis 11"]
["Basis 12"]
["Basis 13"]
["Basis 14"]
["Basis 15"]

{"sheet":"Equipment Costs","index":1,"n_rows":554,"n_cols":16,"rows_kept":554,"cut":false,"hidden":false,"merged":[[448,0,449,0],[337,0,338,0],[121,0,122,0],[1,1,1,2],[2,1,2,2],[3,1,3,2],[229,0,230,0],[10,0,11,0]]}
[]
["File Name:",{"$f":"DataFileName","v":"SRCE_2.0_CostDataFile_USR_Example.xlsm"}]
["Date:",{"$f":"DataFileDate","v":"2008-09-29"}]
["Cost Basis:",{"$f":"DataCostBasis","v":"User Data"}]
["Author/Source:",{"$f":"AuthorSource","v":"AB Consulting"}]
[]
["Monthly Rental Basis\n(operating hrs/ period)",176,176]
["Wet Rate?","No","No"]
[]
["MONTHLY EQUIPMENT RATE TABLE  [Cost Per Month] (1)"]
["EQUIPMENT TYPE (2)","Basis 1","Basis 2","Basis 3","Basis 4","Basis 5","Basis 6","Basis 7","Basis 8","Basis 9","Basis 10","Basis 11","Basis 12","Basis 13","Basis 14","Basis 15"]
[null,{"$f":"IF(ISBLANK(VLOOKUP(B11,RegionNames,2,FALSE)),\"\",VLOOKUP(B11,RegionNames,2,FALSE))","v":"WA ARO"},"WA LOM - site costs","","","","","","","","","","","","",""]
["Bulldozers"]
["D6T",14260.28,14260.28]
["D6R w/ Winch",14960,14960]
["D7E",1950,19086.84]
["D8T",19500,24449.119999999999]
["D9T",28750,20765]
["D10T2",35140.120000000003,35140.120000000003]
["D11T",47014.04,37014.04]
["Wheeled Dozers"]
["824K"]
["834K"]
["844K"]
["854K"]
["Motor Graders"]
["12M2",9680,9680]
["14M",15600,13567]
["16M3",23105.86,21105.86]
["24M",28765,26789]
["Track Excavators"]
["312F",8280.36,8280.36]
["320F",9802.49,9802.49]
["325F",13530,13530]
["330F",16479.54,10479.540000000001]
["349F",19843.95,19843.95]
["374F",24285.45,24285.45]
["390F",28189.3,28189.3]
["Scrapers"]
["631K",27913.74,27913.74]
["637K",32208.17,32208.17]
["Wheeled Loaders"]
["926M",8118,8118]
["930M",9709.1299999999992,9709.1299999999992]
["950M",11726,11726]
["966M",15170.51,15170.51]
["972M",18671.400000000001,18671.400000000001]
["980M",20204.8,19204.8]
["988K",25642.959999999999,25642.959999999999]
["990K",36478,36578]
["992K",41963.97,41963.97]
["994K",95612,95612]
["L2350",100000,100000]
["Shovels/Excavators"]
["PC2000",48560,48560]
["PC3000",55678,55678]
["PC4000",72345,72345]
["PC5500",104567,104567]
["PC8000",104567,104567]
["EX2500",132789,132789]
["Hydraulic Hammers"]
["H120Es (fits 325)",7515.24,7515.24]
["H160Es (fits 349)",9662.4500000000007,9662.4500000000007]
["H180Es (fits 374/390)",12883.27,12883.27]
["Demolition Shears"]
["S3050 (fits 320/325/330)"]
["S3070 (fits 330/349)"]
["S3090 (fits 374/390)"]
["Demolition Grapples"]
["G315B (fits 320/325)"]
["G320B (fits 325/330)"]
["G330 (fits 349/374)"]
["Other Equipment"]
["420F2",14432,14432]
["430F2",16687,16687]
["CS54B",5412,5412]
["CS64B",5772.8,5772.8]
["CP54B",6765,6765]
["CP68B",7892.5,7892.5]
["Light Truck - 1.5 Ton",10043.77,10043.77]
["Supervisor's Truck",3567.41,3567.41]
["Flatbed Truck",9922,9922]
["Air Compressor + tools",1757.01,1757.01]
["Welding Equipment",1122.04,1122.04]
["Heavy Duty Drill Rig",35481.07,35481.07]
["Pump (plugging) Drill Rig",28365.15,28365.15]
["Concrete Pump",38649.800000000003,38649.800000000003]
["Gas Engine Vibrator",2147.21,2147.21]
["Generator 5KW",2147.21,2147.21]
["HDEP Welder (pipe or liner)",1120.28,1120.28]
["5 Ton Crane",19844,19844]
["20 Ton Crane",22550,22550]
["50 Ton Crane",27060,27060]
["120 Ton Crane",47520,47520]
["Trucks"]
["725C",10808.67,10808.67]
["730C",12177,12177]
["735C",13450.2,13450.2]
["740C",18942,18942]
["770G",16944.97,16944.97]
["773G",23056.92,23056.92]
["777G",30465.95,30465.95]
["785D",49673.14,49673.14]
["789D",49673.14,49673.14]
["793F",77718.12,77718.12]
["797F",82456,80645]
["613E (5,000 gal)",13443.41,13443.41]
["621E (8,000 gal)",17924.54,17924.54]
["777D H2O Truck",29794.86,29794.86]
["785C H2O Truck",48708,48708]
[{"$f":"\"Dump Truck (10-12 \"&IF(Metric,\"m\",\"yd\")&\"3)\"","v":"Dump Truck (10-12 m3)"}]
[{"$f":"\"Tractor/Trailer (\"&IF(Metric,\"18\",\"20\")&\" ton)\"","v":"Tractor/Trailer (18 ton)"},10230,10230]
[{"$f":"\"Tractor/Trailer (\"&IF(Metric,\"45\",\"50\")&\" ton)\"","v":"Tractor/Trailer (45 ton)"},16165,16165]
[{"$f":"\"Tractor/Trailer (\"&IF(Metric,\"75\",\"80\")&\" ton)\"","v":"Tractor/Trailer (75 ton)"},20762,20762]
["NOTES:"]
["(1) Power Equipment Source: ","XYC Consulting","XYC Consulting"]
["(2) Power Equipment Type: ","Catepillar model or equivalent, LeTourneau loader, Komatsu shovels","Catepillar model or equivalent, LeTourneau loader, Komatsu shovels","Catepillar model or equivalent, LeTourneau loader, Komatsu shovels","Catepillar model or equivalent, LeTourneau loader, Komatsu shovels","Catepillar model or equivalent, LeTourneau loader, Komatsu shovels","Catepillar model or equivalent, LeTourneau loader, Komatsu shovels","Catepillar model or equivalent, LeTourneau loader, Komatsu shovels","Catepillar model or equivalent, LeTourneau loader, Komatsu shovels","Catepillar model or equivalent, LeTourneau loader, Komatsu shovels","Catepillar model or equivalent, LeTourneau loader, Komatsu shovels","Catepillar model or equivalent, LeTourneau loader, Komatsu shovels","Catepillar model or equivalent, LeTourneau loader, Komatsu shovels","Catepillar model or equivalent, LeTourneau loader, Komatsu shovels","Catepillar model or equivalent, LeTourneau loader, Komatsu shovels","Catepillar model or equivalent, LeTourneau loader, Komatsu shovels"]
["(3) Drilliing Equipment Source: "]
["(4) Other Equipment Source: ","Transport: RS Means","Transport: RS Means"]
[]
["PREVENTATIVE MAINTENANCE COST [Cost Per Hour] (1)"]
["EQUIPMENT TYPE","Basis 1","Basis 2","Basis 3","Basis 4","Basis 5","Basis 6","Basis 7","Basis 8","Basis 9","Basis 10","Basis 11","Basis 12","Basis 13","Basis 14","Basis 15"]
[null,{"$f":"IF(ISBLANK(VLOOKUP(B122,RegionNames,2,FALSE)),\"\",VLOOKUP(B122,RegionNames,2,FALSE))","v":"WA ARO"},"WA LOM - site costs","","","","","","","","","","","","",""]
["Bulldozers"]
[{"$f":"A14","v":"D6T"},32.35,32.44]
["D6R w/ Winch",33.97,34.06]
["D7E",36.39,36.49]
["D8T",40.44,40.549999999999997]
["D9T",44.48,44.6]
["D10T2",59.61,58.77]
["D11T",83.96,84.18]
["Wheeled Dozers"]
["824K"]
["834K"]
["844K"]
["854K"]
["Motor Graders"]
["12M2",23.36,23.43]
["14M",28.95,20.03]
["16M3",37.22,37.32]
["24M",41.11,40.049999999999997]
["Track Excavators"]
["312F",23.5,23.5]
["320F",35.1,35.200000000000003]
["325F",40.11,40.22]
["330F",42.5,42.5]
["349F",45.13,45.25]
["374F",50,50]
["390F",55.15,55.31]
["Scrapers"]
["631K",53.91,54.06]
["637K",80.87,81.099999999999994]
["Wheeled Loaders"]
["926M",15.85,15.89]
["930M",22.64,22.71]
["950M",32.35,32.44]
[{"$f":"A46","v":"966M"},40.44,40.549999999999997]
["972M",47.17,47.31]
["980M",52,52]
["988K",57.96,58.12]
["990K",64.75,66.34]
["992K",80.06,80.28]
["994K",140.11000000000001,140.5]
["L2350",150.34,150.34]
["Shovels/Excavators"]
["PC2000",201.61,201.61]
["PC3000",222.34,222.34]
["PC4000",302.54000000000002,302.54000000000002]
["PC5500",335.76,335.76]
["PC8000",402.88,402.88]
["EX2500",402.88,402.88]
["Hydraulic Hammers"]
["H120Es (fits 325)","N/A","N/A","N/A","N/A","N/A","N/A","N/A","N/A","N/A","N/A","N/A","N/A","N/A","N/A","N/A"]
["H160Es (fits 349)","N/A","N/A","N/A","N/A","N/A","N/A","N/A","N/A","N/A","N/A","N/A","N/A","N/A","N/A","N/A"]
["H180Es (fits 374/390)","N/A","N/A","N/A","N/A","N/A","N/A","N/A","N/A","N/A","N/A","N/A","N/A","N/A","N/A","N/A"]
["Demolition Shears"]
["S3050 (fits 320/325/330)","N/A","N/A","N/A","N/A","N/A","N/A","N/A","N/A","N/A","N/A","N/A","N/A","N/A","N/A","N/A"]
["S3070 (fits 330/349)","N/A","N/A","N/A","N/A","N/A","N/A","N/A","N/A","N/A","N/A","N/A","N/A","N/A","N/A","N/A"]
["S3090 (fits 374/390)","N/A","N/A","N/A","N/A","N/A","N/A","N/A","N/A","N/A","N/A","N/A","N/A","N/A","N/A","N/A"]
["Demolition Grapples"]
["G315B (fits 320/325)","N/A","N/A","N/A","N/A","N/A","N/A","N/A","N/A","N/A","N/A","N/A","N/A","N/A","N/A","N/A"]
["G320B (fits 325/330)","N/A","N/A","N/A","N/A","N/A","N/A","N/A","N/A","N/A","N/A","N/A","N/A","N/A","N/A","N/A"]
["G330 (fits 349/374)","N/A","N/A","N/A","N/A","N/A","N/A","N/A","N/A","N/A","N/A","N/A","N/A","N/A","N/A","N/A"]
["Other Equipment"]
["420F2",9.32,9.342191684611203]
["430F2",6.56,6.1965000000000003]
["CS54B",7.29,6.8849999999999998]
["CS64B",8.1,7.65]
[{"$f":"A78","v":"CP54B"},9,8.5]
["CP68B",9.9,9.35]
["Light Truck - 1.5 Ton",3.45,3.45]
["Supervisor's Truck",4.5,4.5]
["Flatbed Truck",4.5,4.5]
["Air Compressor + tools",1.23,1.23]
["Welding Equipment",3,3]
["Heavy Duty Drill Rig",8.76,8.76]
["Pump (plugging) Drill Rig",7.56,7.56]
["Concrete Pump",2.2000000000000002,2.2000000000000002]
["Gas Engine Vibrator",1.76,1.76]
["Generator 5KW",1.24,1.24]
["HDEP Welder (pipe or liner)",1.32,1.32]
["5 Ton Crane",7.25,7.2661490880309367]
["20 Ton Crane",10.35,10.380212982901339]
["50 Ton Crane",12.94,12.975266228626673]
["120 Ton Crane",19.399999999999999,19.462899342940005]
["Trucks"]
["725C",30.81,30.81]
["730C",33.380000000000003,33.380000000000003]
["735C",36.56,36.56]
["740C",36.56,36.56]
["770G",38.82,38.82]
["773G",40.130000000000003,40.130000000000003]
["777G",49.06,49.06]
["785D",77.25,77.25]
["789D",77.25,77.25]
["793F",151.12,151.12]
["797F",172.11,172.11]
["613E (5,000 gal)",35.04,35.04]
["621E (8,000 gal)",37.85,37.85]
["777D H2O Truck",60.22,60.22]
[{"$f":"A110","v":"785C H2O Truck"},77.25,77.25]
[{"$f":"A111","v":"Dump Truck (10-12 m3)"},28.04,28.04]
["Tractor/Trailer (18 ton)","N/A","N/A","N/A","N/A","N/A","N/A","N/A","N/A","N/A","N/A","N/A","N/A","N/A","N/A","N/A"]
["Tractor/Trailer (45 ton)","N/A","N/A","N/A","N/A","N/A","N/A","N/A","N/A","N/A","N/A","N/A","N/A","N/A","N/A","N/A"]
["Tractor/Trailer (75 ton)","N/A","N/A","N/A","N/A","N/A","N/A","N/A","N/A","N/A","N/A","N/A","N/A","N/A","N/A","N/A"]
["NOTES:"]
["(1) PM Source: ","XYC Consulting","XYC Consulting"]
[]
["G.E.T CONSUMPTION [Cost Per Hour] (1) (Wear Items)"]
["EQUIPMENT TYPE","Basis 1","Basis 2","Basis 3","Basis 4","Basis 5","Basis 6","Basis 7","Basis 8","Basis 9","Basis 10","Basis 11","Basis 12","Basis 13","Basis 14","Basis 15"]
[null,{"$f":"IF(ISBLANK(VLOOKUP(B230,RegionNames,2,FALSE)),\"\",VLOOKUP(B230,RegionNames,2,FALSE))","v":"WA ARO"},"WA LOM - site costs","","","","","","","","","","","","",""]
["Bulldozers"]
[{"$f":"A14","v":"D6T"},3.3,3.3]
["D6R w/ Winch",3.63,3.63]
["D7E",4.9800000000000004,4.9800000000000004]
["D8T",6.6,6.6]
["D9T",9.89,9.89]
["D10T2",16.489999999999998,16.489999999999998]
["D11T",26.39,26.39]
["Wheeled Dozers"]
["824K"]
["834K"]
["844K"]
["854K"]
["Motor Graders"]
["12M2",2.8,2.8]
["14M",3.6,3.6]
["16M3",5.58,5.58]
["24M",7.86,7.86]
["Track Excavators"]
["312F",2.8,2.8]
["320F",3.04,3.04]
["325F",5.07,5.07]
["330F",6.09,6.09]
["349F",7.61,7.61]
["374F",8.6300000000000008,8.6300000000000008]
["390F",10.15,10.15]
["Scrapers"]
["631K",7.61,7.61]
["637K",7.61,7.61]
["Wheeled Loaders"]
["926M",3.02,3.02]
["930M",3.55,3.55]
["950M",4.3099999999999996,4.3099999999999996]
[{"$f":"A46","v":"966M"},5.07,5.07]
["972M",7.61,7.61]
["980M",8.6300000000000008,8.6300000000000008]
["988K",10.15,10.15]
["990K",11.23,11.23]
["992K",12.69,12.69]
["994K",23.47,23.47]
["L2350",27.65,27.65]
["Shovels/Excavators"]
["PC2000",27.54,27.54]
["PC3000",28.1,28.1]
["PC4000",30.78,30.78]
["PC5500",33.119999999999997,33.119999999999997]
["PC8000",33.119999999999997,33.119999999999997]
["EX2500",45.78,45.78]
["Hydraulic Hammers"]
["H120Es (fits 325)",2.54,2.54]
["H160Es (fits 349)",3.55,3.55]
["H180Es (fits 374/390)",4.57,4.57]
["Demolition Shears"]
["S3050 (fits 320/325/330)",2.5299999999999998,2.5299999999999998]
["S3070 (fits 330/349)",2.79,2.79]
["S3090 (fits 374/390)",2.8,2.8]
["Demolition Grapples"]
["G315B (fits 320/325)"]
["G320B (fits 325/330)"]
["G330 (fits 349/374)"]
["Other Equipment"]
["420F2"]
["430F2"]
["CS54B"]
["CS64B"]
[{"$f":"A78","v":"CP54B"}]
["CP68B"]
["Light Truck - 1.5 Ton"]
["Supervisor's Truck"]
["Flatbed Truck"]
["Air Compressor + tools","N/A","N/A","N/A","N/A","N/A","N/A","N/A","N/A","N/A","N/A","N/A","N/A","N/A","N/A","N/A"]
["Welding Equipment","N/A","N/A","N/A","N/A","N/A","N/A","N/A","N/A","N/A","N/A","N/A","N/A","N/A","N/A","N/A"]
["Heavy Duty Drill Rig"]
["Pump (plugging) Drill Rig"]
["Concrete Pump","N/A","N/A","N/A","N/A","N/A","N/A","N/A","N/A","N/A","N/A","N/A","N/A","N/A","N/A","N/A"]
["Gas Engine Vibrator","N/A","N/A","N/A","N/A","N/A","N/A","N/A","N/A","N/A","N/A","N/A","N/A","N/A","N/A","N/A"]
["Generator 5KW","N/A","N/A","N/A","N/A","N/A","N/A","N/A","N/A","N/A","N/A","N/A","N/A","N/A","N/A","N/A"]
["HDEP Welder (pipe or liner)","N/A","N/A","N/A","N/A","N/A","N/A","N/A","N/A","N/A","N/A","N/A","N/A","N/A","N/A","N/A"]
["5 Ton Crane"]
["20 Ton Crane"]
["50 Ton Crane"]
["120 Ton Crane"]
["Trucks"]
["725C",2.33,2.33]
["730C",2.44,2.44]
["735C",2.54,2.54]
["740C",2.64,2.64]
["770G",2.92,2.92]
["773G",4.0599999999999996,4.0599999999999996]
["777G",5.25,5.25]
["785D",8.1199999999999992,8.1199999999999992]
["789D",8.1199999999999992,8.1199999999999992]
["793F",12,12]
["797F",15,15]
["613E (5,000 gal)"]
["621E (8,000 gal)"]
["777D H2O Truck",0,0]
[{"$f":"A110","v":"785C H2O Truck"},0,0]
[{"$f":"A111","v":"Dump Truck (10-12 m3)"},1.1200000000000001,1.1200000000000001]
["Tractor/Trailer (18 ton)","N/A","N/A","N/A","N/A","N/A","N/A","N/A","N/A","N/A","N/A","N/A","N/A","N/A","N/A","N/A"]
["Tractor/Trailer (45 ton)","N/A","N/A","N/A","N/A","N/A","N/A","N/A","N/A","N/A","N/A","N/A","N/A","N/A","N/A","N/A"]
["Tractor/Trailer (75 ton)","N/A","N/A","N/A","N/A","N/A","N/A","N/A","N/A","N/A","N/A","N/A","N/A","N/A","N/A","N/A"]
["Notes:"]
["(1) G.E.T. Source: ","CAT Historical Data","CAT Historical Data"]
[]
["TIRE COST TABLE [Cost Per Tire(1,2,3)]"]
["EQUIPMENT TYPE","Basis 1","Basis 2","Basis 3","Basis 4","Basis 5","Basis 6","Basis 7","Basis 8","Basis 9","Basis 10","Basis 11","Basis 12","Basis 13","Basis 14","Basis 15"]
[null,{"$f":"IF(ISBLANK(VLOOKUP(B338,RegionNames,2,FALSE)),\"\",VLOOKUP(B338,RegionNames,2,FALSE))","v":"WA ARO"},"WA LOM - site costs","","","","","","","","","","","","",""]
["Bulldozers"]
[{"$f":"A14","v":"D6T"},"N/A","N/A","N/A","N/A","N/A","N/A","N/A","N/A","N/A","N/A","N/A","N/A","N/A","N/A","N/A"]
["D6R w/ Winch","N/A","N/A","N/A","N/A","N/A","N/A","N/A","N/A","N/A","N/A","N/A","N/A","N/A","N/A","N/A"]
["D7E","N/A","N/A","N/A","N/A","N/A","N/A","N/A","N/A","N/A","N/A","N/A","N/A","N/A","N/A","N/A"]
["D8T","N/A","N/A","N/A","N/A","N/A","N/A","N/A","N/A","N/A","N/A","N/A","N/A","N/A","N/A","N/A"]
["D9T","N/A","N/A","N/A","N/A","N/A","N/A","N/A","N/A","N/A","N/A","N/A","N/A","N/A","N/A","N/A"]
["D10T2","N/A","N/A","N/A","N/A","N/A","N/A","N/A","N/A","N/A","N/A","N/A","N/A","N/A","N/A","N/A"]
["D11T","N/A","N/A","N/A","N/A","N/A","N/A","N/A","N/A","N/A","N/A","N/A","N/A","N/A","N/A","N/A"]
["Wheeled Dozers"]
["824K"]
["834K"]
["844K"]
["854K"]
["Motor Graders"]
["12M2",2850,2850]
["14M",3141,3141]
["16M3",4133,4133]
["24M",6234,6234]
["Track Excavators"]
["312F","N/A","N/A","N/A","N/A","N/A","N/A","N/A","N/A","N/A","N/A","N/A","N/A","N/A","N/A","N/A"]
["320F","N/A","N/A","N/A","N/A","N/A","N/A","N/A","N/A","N/A","N/A","N/A","N/A","N/A","N/A","N/A"]
["325F","N/A","N/A","N/A","N/A","N/A","N/A","N/A","N/A","N/A","N/A","N/A","N/A","N/A","N/A","N/A"]
["330F","N/A","N/A","N/A","N/A","N/A","N/A","N/A","N/A","N/A","N/A","N/A","N/A","N/A","N/A","N/A"]
["349F","N/A","N/A","N/A","N/A","N/A","N/A","N/A","N/A","N/A","N/A","N/A","N/A","N/A","N/A","N/A"]
["374F","N/A","N/A","N/A","N/A","N/A","N/A","N/A","N/A","N/A","N/A","N/A","N/A","N/A","N/A","N/A"]
["390F","N/A","N/A","N/A","N/A","N/A","N/A","N/A","N/A","N/A","N/A","N/A","N/A","N/A","N/A","N/A"]
["Scrapers"]
["631K",10863,10863]
["637K",10863,10863]
["Wheeled Loaders"]
["926M",1260,1260]
["930M",1361,1361]
["950M",1512,1512]
[{"$f":"A46","v":"966M"},3125,3125]
["972M",4234,4234]
["980M",4234,4234]
["988K",9173,9173]
["990K",12567,12567]
["992K",15822,15822]
["994K",54797,54797]
["L2350",63456,63456]
["Shovels/Excavators"]
["PC2000","N/A","N/A","N/A","N/A","N/A","N/A","N/A","N/A","N/A","N/A","N/A","N/A","N/A","N/A","N/A"]
["PC3000","N/A","N/A","N/A","N/A","N/A","N/A","N/A","N/A","N/A","N/A","N/A","N/A","N/A","N/A","N/A"]
["PC4000","N/A","N/A","N/A","N/A","N/A","N/A","N/A","N/A","N/A","N/A","N/A","N/A","N/A","N/A","N/A"]
["PC5500","N/A","N/A","N/A","N/A","N/A","N/A","N/A","N/A","N/A","N/A","N/A","N/A","N/A","N/A","N/A"]
["PC8000","N/A","N/A","N/A","N/A","N/A","N/A","N/A","N/A","N/A","N/A","N/A","N/A","N/A","N/A","N/A"]
["EX2500","N/A","N/A","N/A","N/A","N/A","N/A","N/A","N/A","N/A","N/A","N/A","N/A","N/A","N/A","N/A"]
["Hydraulic Hammers"]
["H120Es (fits 325)","N/A","N/A","N/A","N/A","N/A","N/A","N/A","N/A","N/A","N/A","N/A","N/A","N/A","N/A","N/A"]
["H160Es (fits 349)","N/A","N/A","N/A","N/A","N/A","N/A","N/A","N/A","N/A","N/A","N/A","N/A","N/A","N/A","N/A"]
["H180Es (fits 374/390)","N/A","N/A","N/A","N/A","N/A","N/A","N/A","N/A","N/A","N/A","N/A","N/A","N/A","N/A","N/A"]
["Demolition Shears"]
["S3050 (fits 320/325/330)","N/A","N/A","N/A","N/A","N/A","N/A","N/A","N/A","N/A","N/A","N/A","N/A","N/A","N/A","N/A"]
["S3070 (fits 330/349)","N/A","N/A","N/A","N/A","N/A","N/A","N/A","N/A","N/A","N/A","N/A","N/A","N/A","N/A","N/A"]
["S3090 (fits 374/390)","N/A","N/A","N/A","N/A","N/A","N/A","N/A","N/A","N/A","N/A","N/A","N/A","N/A","N/A","N/A"]
["Demolition Grapples"]
["G315B (fits 320/325)","N/A","N/A","N/A","N/A","N/A","N/A","N/A","N/A","N/A","N/A","N/A","N/A","N/A","N/A","N/A"]
["G320B (fits 325/330)","N/A","N/A","N/A","N/A","N/A","N/A","N/A","N/A","N/A","N/A","N/A","N/A","N/A","N/A","N/A"]
["G330 (fits 349/374)","N/A","N/A","N/A","N/A","N/A","N/A","N/A","N/A","N/A","N/A","N/A","N/A","N/A","N/A","N/A"]
["Other Equipment"]
["420F2",3024,3024]
["430F2",3226,3226]
["CS54B","N/A","N/A","N/A","N/A","N/A","N/A","N/A","N/A","N/A","N/A","N/A","N/A","N/A","N/A","N/A"]
["CS64B","N/A","N/A","N/A","N/A","N/A","N/A","N/A","N/A","N/A","N/A","N/A","N/A","N/A","N/A","N/A"]
[{"$f":"A78","v":"CP54B"},"N/A","N/A","N/A","N/A","N/A","N/A","N/A","N/A","N/A","N/A","N/A","N/A","N/A","N/A","N/A"]
["CP68B","N/A","N/A","N/A","N/A","N/A","N/A","N/A","N/A","N/A","N/A","N/A","N/A","N/A","N/A","N/A"]
["Light Truck - 1.5 Ton"]
["Supervisor's Truck"]
["Flatbed Truck"]
["Air Compressor + tools","N/A","N/A","N/A","N/A","N/A","N/A","N/A","N/A","N/A","N/A","N/A","N/A","N/A","N/A","N/A"]
["Welding Equipment","N/A","N/A","N/A","N/A","N/A","N/A","N/A","N/A","N/A","N/A","N/A","N/A","N/A","N/A","N/A"]
["Heavy Duty Drill Rig"]
["Pump (plugging) Drill Rig"]
["Concrete Pump","N/A","N/A","N/A","N/A","N/A","N/A","N/A","N/A","N/A","N/A","N/A","N/A","N/A","N/A","N/A"]
["Gas Engine Vibrator","N/A","N/A","N/A","N/A","N/A","N/A","N/A","N/A","N/A","N/A","N/A","N/A","N/A","N/A","N/A"]
["Generator 5KW","N/A","N/A","N/A","N/A","N/A","N/A","N/A","N/A","N/A","N/A","N/A","N/A","N/A","N/A","N/A"]
["HDEP Welder (pipe or liner)","N/A","N/A","N/A","N/A","N/A","N/A","N/A","N/A","N/A","N/A","N/A","N/A","N/A","N/A","N/A"]
["5 Ton Crane"]
["20 Ton Crane"]
["50 Ton Crane"]
["120 Ton Crane"]
["Trucks"]
["725C",1971,1971]
["730C",2420,2120]
["735C",3226,3226]
["740C",4869,4569]
["770G",3303,3303]
["773G",5367,5367]
["777G",10011,11011]
["785D",19655,19655]
["789D",19655,19655]
["793F",44405,44405]
["797F",52345,52345]
["613E (5,000 gal)",2520,2420]
["621E (8,000 gal)",3835,3835]
["777D H2O Truck",10011,10011]
["785C H2O Truck",19655,20655]
["Dump Truck (10-12 m3)",535,535]
["Tractor/Trailer (18 ton)",28.04,28.04]
["Tractor/Trailer (45 ton)",28.04,28.04]
["Tractor/Trailer (75 ton)",28.04,28.04]
["Notes:"]
["(1) Unit Cost Basis:","Cost per tyre each","Cost per tyre each"]
["(2) Cost Basis:"]
["(3) Tire Cost Source:","AB Consulting"]
["(4) Tire Wear Source \n(defined in model):","Caterpillar Handbook, Edition 37","Caterpillar Handbook, Edition 37"]
[]
["Assembly/Disassembly [Total Cost]"]
["EQUIPMENT TYPE","Basis 1","Basis 2","Basis 3","Basis 4","Basis 5","Basis 6","Basis 7","Basis 8","Basis 9","Basis 10","Basis 11","Basis 12","Basis 13","Basis 14","Basis 15"]
[null,{"$f":"IF(ISBLANK(VLOOKUP(B449,RegionNames,2,FALSE)),\"\",VLOOKUP(B449,RegionNames,2,FALSE))","v":"WA ARO"},"WA LOM - site costs","","","","","","","","","","","","",""]
["Bulldozers"]
[{"$f":"A14","v":"D6T"},"N/A","N/A"]
[{"$f":"A15","v":"D6R w/ Winch"},"N/A","N/A"]
["D7E","N/A","N/A"]
["D8T","N/A","N/A"]
["D9T","N/A","N/A"]
["D10T2",12250,12250]
["D11T",43850,43850]
["Wheeled Dozers"]
["824K","N/A","N/A"]
["834K","N/A","N/A"]
["844K","N/A","N/A"]
["854K"]
["Motor Graders"]
["12M2","N/A","N/A"]
["14M","N/A","N/A"]
["16M3","N/A","N/A"]
["24M",12000,12000]
["Track Excavators"]
["312F","N/A","N/A"]
["320F","N/A","N/A"]
["325F","N/A","N/A"]
["330F","N/A","N/A"]
["349F","N/A","N/A"]
["374F","N/A","N/A"]
["390F",13400,13400]
["Scrapers"]
["631K","N/A","N/A"]
["637K","N/A","N/A"]
["Wheeled Loaders"]
["926M","N/A","N/A"]
["930M","N/A","N/A"]
["950M","N/A","N/A"]
["966M","N/A","N/A"]
["972M","N/A","N/A"]
["980M","N/A","N/A"]
["988K","N/A","N/A"]
["990K",23350,23350]
["992K",23350,23350]
["994K",23350,23350]
["L2350",23350,23350]
["Shovels/Excavators"]
["PC2000",25000,25000]
["PC3000",30000,30000]
["PC4000",35000,35000]
["PC5500",40000,40000]
["PC8000",45000,45000]
["EX2500",45000,45000]
["Hydraulic Hammers"]
["H120Es (fits 325)","N/A","N/A"]
["H160Es (fits 349)","N/A","N/A"]
["H180Es (fits 374/390)","N/A","N/A"]
["Demolition Shears"]
["S3050 (fits 320/325/330)","N/A","N/A"]
["S3070 (fits 330/349)","N/A","N/A"]
["S3090 (fits 374/390)","N/A","N/A"]
["Demolition Grapples"]
["G315B (fits 320/325)","N/A","N/A"]
["G320B (fits 325/330)","N/A","N/A"]
["G330 (fits 349/374)","N/A","N/A"]
["Other Equipment"]
["420F2","N/A","N/A"]
["430F2","N/A","N/A"]
["CS54B","N/A","N/A"]
["CS64B","N/A","N/A"]
["CP54B","N/A","N/A"]
[{"$f":"A79","v":"CP68B"},"N/A","N/A"]
["Light Truck - 1.5 Ton","N/A","N/A"]
["Supervisor's Truck","N/A","N/A"]
["Flatbed Truck","N/A","N/A"]
["Air Compressor + tools","N/A","N/A"]
["Welding Equipment","N/A","N/A"]
["Heavy Duty Drill Rig","N/A","N/A"]
["Pump (plugging) Drill Rig","N/A","N/A"]
["Concrete Pump","N/A","N/A"]
["Gas Engine Vibrator","N/A","N/A"]
["Generator 5KW","N/A","N/A"]
["HDEP Welder (pipe or liner)","N/A","N/A"]
["5 Ton Crane","N/A","N/A"]
["20 Ton Crane","N/A","N/A"]
["50 Ton Crane","N/A","N/A"]
["120 Ton Crane","N/A","N/A"]
["Trucks"]
["725C","N/A","N/A"]
["730C","N/A","N/A"]
["735C","N/A","N/A"]
["740C","N/A","N/A"]
["770G","N/A","N/A"]
["773G","N/A","N/A"]
["777G",24150,24150]
["785D",26000,26000]
["789D",30000,30000]
["793F",35000,35000]
["797F",40000,40000]
["613E (5,000 gal)","N/A","N/A"]
["621E (8,000 gal)","N/A","N/A"]
["777D H2O Truck",24150,24150]
["785C H2O Truck",26000,26000]
["Dump Truck (10-12 m3)"]
["Tractor/Trailer (18 ton)","N/A","N/A","N/A","N/A","N/A","N/A","N/A","N/A","N/A","N/A","N/A","N/A","N/A","N/A","N/A"]
["Tractor/Trailer (45 ton)","N/A","N/A","N/A","N/A","N/A","N/A","N/A","N/A","N/A","N/A","N/A","N/A","N/A","N/A","N/A"]
["Tractor/Trailer (75 ton)","N/A","N/A","N/A","N/A","N/A","N/A","N/A","N/A","N/A","N/A","N/A","N/A","N/A","N/A","N/A"]
["Notes:"]
["Assembly/Disassembly Source: "]

{"sheet":"Labor Rates","index":2,"n_rows":200,"n_cols":69,"rows_kept":200,"cut":false,"hidden":false,"merged":[[8,27,8,28],[8,29,8,30],[8,15,8,16],[8,17,8,18],[8,19,8,20],[8,21,8,22],[8,23,8,24],[8,25,8,26],[7,0,8,0],[7,29,7,30],[7,27,7,28],[7,25,7,26],[7,23,7,24],[7,1,7,2],[7,21,7,22],[7,19,7,20],[7,13,7,14],[7,11,7,12],[7,17,7,18],[7,15,7,16],[7,5,7,6],[7,3,7,4],[7,9,7,10],[7,7,7,8],[202,1,202,2],[202,3,202,4],[202,5,202,6],[202,7,202,8],[202,21,202,22],[162,17,162,18],[162,19,162,20],[162,21,162,22],[201,17,201,18],[201,19,201,20],[201,13,201,14],[201,15,201,16],[202,9,202,10],[202,11,202,12],[202,13,202,14],[202,15,202,16],[201,9,201,10],[201,11,201,12],[201,1,201,2],[201,3,201,4],[201,5,201,6],[201,7,201,8],[188,7,188,8],[188,9,188,10],[202,17,202,18],[202,19,202,20],[199,17,199,18],[202,23,202,24],[105,25,105,26],[201,25,201,26],[202,25,202,26],[162,23,162,24],[162,25,162,26],[105,17,105,18],[105,19,105,20],[201,21,201,22],[161,19,161,20],[161,21,161,22],[139,21,139,22],[200,19,200,20],[200,21,200,22],[199,19,199,20],[199,21,199,22],[140,21,140,22],[187,21,187,22],[188,25,188,26],[188,17,188,18],[188,19,188,20],[201,27,201,28],[199,25,199,26],[140,25,140,26],[200,23,200,24],[200,25,200,26],[202,27,202,28],[105,29,105,30],[201,29,201,30],[202,29,202,30],[162,27,162,28],[162,29,162,30],[201,23,201,24],[161,27,161,28],[139,27,139,28],[139,23,139,24],[140,23,140,24],[140,27,140,28],[106,25,106,26],[199,23,199,24],[163,23,163,24],[199,27,199,28],[200,27,200,28],[188,27,188,28],[188,29,188,30],[200,1,200,2],[200,3,200,4],[200,5,200,6],[200,7,200,8],[199,1,199,2],[199,3,199,4],[199,5,199,6],[199,7,199,8],[105,21,105,22],[162,15,162,16],[186,13,186,14],[186,15,186,16],[139,15,139,16],[187,15,187,16],[187,17,187,18],[187,19,187,20],[105,11,105,12],[105,13,105,14],[105,15,105,16],[105,5,105,6],[105,7,105,8],[161,5,161,6],[188,11,188,12],[188,13,188,14],[199,29,199,30],[200,29,200,30],[161,29,161,30],[187,13,187,14],[187,27,187,28],[187,29,187,30],[199,13,199,14],[163,25,163,26],[163,13,163,14],[188,15,188,16],[188,21,188,22],[188,23,188,24],[163,29,163,30],[186,29,186,30],[163,27,163,28],[186,19,186,20],[186,27,186,28],[187,23,187,24],[187,25,187,26],[163,21,163,22],[161,23,161,24],[161,25,161,26],[163,19,163,20],[186,25,186,26],[199,9,199,10],[199,11,199,12],[200,17,200,18],[200,13,200,14],[200,15,200,16],[200,9,200,10],[200,11,200,12],[199,15,199,16],[162,11,162,12],[186,9,186,10],[187,9,187,10],[163,9,163,10],[163,11,163,12],[163,15,163,16],[163,17,163,18],[187,11,187,12],[186,11,186,12],[162,13,162,14],[162,9,162,10],[140,1,140,2],[140,3,140,4],[140,5,140,6],[105,9,105,10],[139,29,139,30],[139,19,139,20],[140,15,140,16],[140,17,140,18],[140,19,140,20],[105,27,105,28],[106,27,106,28],[106,29,106,30],[140,29,140,30],[139,25,139,26],[106,19,106,20],[106,23,106,24],[106,9,106,10],[106,11,106,12],[106,13,106,14],[106,15,106,16],[106,21,106,22],[106,17,106,18],[139,17,139,18],[1,1,1,3],[2,1,2,3],[3,1,3,3],[139,1,139,2],[139,3,139,4],[106,1,106,2],[106,3,106,4],[105,3,105,4],[105,1,105,2],[8,1,8,2],[187,7,187,8],[187,3,187,4],[187,5,187,6],[187,1,187,2],[188,1,188,2],[188,3,188,4],[188,5,188,6],[105,23,105,24],[8,11,8,12],[8,13,8,14],[8,3,8,4],[8,5,8,6],[8,7,8,8],[8,9,8,10],[139,5,139,6],[139,7,139,8],[106,5,106,6],[106,7,106,8],[139,13,139,14],[140,13,140,14],[139,11,139,12],[140,9,140,10],[140,11,140,12],[139,9,139,10],[186,5,186,6],[186,7,186,8],[163,5,163,6],[161,1,161,2],[161,3,161,4],[162,5,162,6],[162,7,162,8],[162,1,162,2],[162,3,162,4],[186,1,186,2],[186,3,186,4],[163,1,163,2],[163,3,163,4],[163,7,163,8],[161,7,161,8],[161,15,161,16],[161,17,161,18],[161,9,161,10],[161,11,161,12],[161,13,161,14],[186,21,186,22],[186,23,186,24],[186,17,186,18],[140,7,140,8]]}
[]
["File Name:",{"$f":"DataFileName","v":"SRCE_2.0_CostDataFile_USR_Example.xlsm"}]
["Date:",{"$f":"DataFileDate","v":"2008-09-29"}]
["Cost Basis:",{"$f":"DataCostBasis","v":"User Data"},null,null,null,null,null,null,null,null,null,null,null,null,null,null,null,null,null,null,null,null,null,null,null,null,null,null,null,null,null,null,null,null,null,null,null,null,null,null,null,null,null,null,null,null,null,null,null,null,null,null,null,null,null,null,null,null,null,null,null,null,null,null,null,{"$f":"MID(CELL(\"filename\",BO4),FIND(\"[\",CELL(\"filename\",BO4))+1,FIND(\"]\",CELL(\"filename\",BO4),FIND(\"[\",CELL(\"filename\",BO4))+1)-FIND(\"[\",CELL(\"filename\",BO4))-1)","v":"SRCE_2.0_CostDataFile_USR_Example.xlsm"},{"$f":"FIND(\"]\",BQ4,BP4+1)","v":138},{"$f":"FIND(\"[\",BQ4)","v":99},{"$f":"CELL(\"filename\",A1)","v":"C:\\Users\\jparshley\\OneDrive - SRK Consulting\\__SRCE 2.0\\_Working Files\\__Q3 2017\\Final to Website\\[SRCE_2.0_CostDataFile_USR_Example.xlsm]Labor Rates"}]
["Author/Source:",{"$f":"AuthorSource","v":"AB Consulting"}]
[]
["HOURLY LABOR RATE TABLE"]
["EQUIPMENT TYPE (1)    OR JOB DESCRIPTION","Basis 1",null,"Basis 2",null,"Basis 3",null,"Basis 4",null,"Basis 5",null,"Basis 6",null,"Basis 7",null,"Basis 8",null,"Basis 9",null,"Basis 10",null,"Basis 11",null,"Basis 12",null,"Basis 13",null,"Basis 14",null,"Basis 15"]
[null,{"$f":"IF(ISBLANK(VLOOKUP(B8,RegionNames,2,FALSE)),\"\",VLOOKUP(B8,RegionNames,2,FALSE))","v":"WA ARO"},null,{"$f":"IF(ISBLANK(VLOOKUP(D8,RegionNames,2,FALSE)),\"\",VLOOKUP(D8,RegionNames,2,FALSE))","v":"WA LOM - site costs"},null,{"$f":"IF(ISBLANK(VLOOKUP(F8,RegionNames,2,FALSE)),\"\",VLOOKUP(F8,RegionNames,2,FALSE))","v":""},null,{"$f":"IF(ISBLANK(VLOOKUP(H8,RegionNames,2,FALSE)),\"\",VLOOKUP(H8,RegionNames,2,FALSE))","v":""},null,{"$f":"IF(ISBLANK(VLOOKUP(J8,RegionNames,2,FALSE)),\"\",VLOOKUP(J8,RegionNames,2,FALSE))","v":""},null,{"$f":"IF(ISBLANK(VLOOKUP(L8,RegionNames,2,FALSE)),\"\",VLOOKUP(L8,RegionNames,2,FALSE))","v":""},null,{"$f":"IF(ISBLANK(VLOOKUP(N8,RegionNames,2,FALSE)),\"\",VLOOKUP(N8,RegionNames,2,FALSE))","v":""},null,{"$f":"IF(ISBLANK(VLOOKUP(P8,RegionNames,2,FALSE)),\"\",VLOOKUP(P8,RegionNames,2,FALSE))","v":""},null,{"$f":"IF(ISBLANK(VLOOKUP(R8,RegionNames,2,FALSE)),\"\",VLOOKUP(R8,RegionNames,2,FALSE))","v":""},null,{"$f":"IF(ISBLANK(VLOOKUP(T8,RegionNames,2,FALSE)),\"\",VLOOKUP(T8,RegionNames,2,FALSE))","v":""},null,{"$f":"IF(ISBLANK(VLOOKUP(V8,RegionNames,2,FALSE)),\"\",VLOOKUP(V8,RegionNames,2,FALSE))","v":""},null,{"$f":"IF(ISBLANK(VLOOKUP(X8,RegionNames,2,FALSE)),\"\",VLOOKUP(X8,RegionNames,2,FALSE))","v":""},null,{"$f":"IF(ISBLANK(VLOOKUP(Z8,RegionNames,2,FALSE)),\"\",VLOOKUP(Z8,RegionNames,2,FALSE))","v":""},null,{"$f":"IF(ISBLANK(VLOOKUP(AB8,RegionNames,2,FALSE)),\"\",VLOOKUP(AB8,RegionNames,2,FALSE))","v":""},null,{"$f":"IF(ISBLANK(VLOOKUP(AD8,RegionNames,2,FALSE)),\"\",VLOOKUP(AD8,RegionNames,2,FALSE))","v":""}]
["EQUIPMENT OPERATORS - Labor Groups and Base Pay Rate ($/hr) (2)"]
["Bulldozers"]
[{"$f":"'Equipment Costs'!A14","v":"D6T"},null,63.86,null,40.409999999999997]
[{"$f":"'Equipment Costs'!A15","v":"D6R w/ Winch"},null,63.86,null,40.409999999999997]
[{"$f":"'Equipment Costs'!A16","v":"D7E"},null,63.86,null,40.409999999999997]
[{"$f":"'Equipment Costs'!A17","v":"D8T"},null,63.86,null,40.409999999999997]
[{"$f":"'Equipment Costs'!A18","v":"D9T"},null,63.86,null,40.409999999999997]
[{"$f":"'Equipment Costs'!A19","v":"D10T2"},null,66.06,null,42.54]
[{"$f":"'Equipment Costs'!A20","v":"D11T"},null,66.06,null,42.54]
[{"$f":"'Equipment Costs'!A21","v":"Wheeled Dozers"}]
[{"$f":"'Equipment Costs'!A22","v":"824K"}]
[{"$f":"'Equipment Costs'!A23","v":"834K"}]
[{"$f":"'Equipment Costs'!A24","v":"844K"}]
[{"$f":"'Equipment Costs'!A25","v":"854K"}]
[{"$f":"'Equipment Costs'!A26","v":"Motor Graders"}]
[{"$f":"'Equipment Costs'!A27","v":"12M2"},null,63.86,null,40.409999999999997]
[{"$f":"'Equipment Costs'!A28","v":"14M"},null,63.86,null,40.409999999999997]
[{"$f":"'Equipment Costs'!A29","v":"16M3"},null,63.86,null,40.409999999999997]
[{"$f":"'Equipment Costs'!A30","v":"24M"},null,63.86,null,40.409999999999997]
[{"$f":"'Equipment Costs'!A31","v":"Track Excavators"}]
[{"$f":"'Equipment Costs'!A32","v":"312F"},null,63.86,null,40.409999999999997]
[{"$f":"'Equipment Costs'!A33","v":"320F"},null,63.86,null,40.409999999999997]
[{"$f":"'Equipment Costs'!A34","v":"325F"},null,63.86,null,40.409999999999997]
[{"$f":"'Equipment Costs'!A35","v":"330F"},null,63.86,null,40.409999999999997]
[{"$f":"'Equipment Costs'!A36","v":"349F"},null,66.06,null,42.54]
[{"$f":"'Equipment Costs'!A37","v":"374F"},null,66.06,null,42.54]
[{"$f":"'Equipment Costs'!A38","v":"390F"},null,66.06,null,42.54]
[{"$f":"'Equipment Costs'!A39","v":"Scrapers"}]
[{"$f":"'Equipment Costs'!A40","v":"631K"},null,63.86,null,40.409999999999997]
[{"$f":"'Equipment Costs'!A41","v":"637K"},null,63.86,null,40.409999999999997]
[{"$f":"'Equipment Costs'!A42","v":"Wheeled Loaders"}]
[{"$f":"'Equipment Costs'!A43","v":"926M"},null,63.86,null,40.409999999999997]
[{"$f":"'Equipment Costs'!A44","v":"930M"},null,63.86,null,40.409999999999997]
[{"$f":"'Equipment Costs'!A45","v":"950M"},null,63.86,null,40.409999999999997]
[{"$f":"'Equipment Costs'!A46","v":"966M"},null,63.86,null,40.409999999999997]
[{"$f":"'Equipment Costs'!A47","v":"972M"},null,63.86,null,40.409999999999997]
[{"$f":"'Equipment Costs'!A48","v":"980M"},null,63.86,null,40.409999999999997]
[{"$f":"'Equipment Costs'!A49","v":"988K"},null,63.86,null,40.409999999999997]
[{"$f":"'Equipment Costs'!A50","v":"990K"},null,63.86,null,40.409999999999997]
[{"$f":"'Equipment Costs'!A51","v":"992K"},null,66.06,null,42.54]
[{"$f":"'Equipment Costs'!A52","v":"994K"},null,66.06,null,42.54]
[{"$f":"'Equipment Costs'!A53","v":"L2350"},null,66.06,null,42.54]
[{"$f":"'Equipment Costs'!A54","v":"Shovels/Excavators"}]
[{"$f":"'Equipment Costs'!A55","v":"PC2000"},null,66.06,null,52.35]
[{"$f":"'Equipment Costs'!A56","v":"PC3000"},null,68.33,null,59.45]
[{"$f":"'Equipment Costs'!A57","v":"PC4000"},null,68.33,null,59.45]
[{"$f":"'Equipment Costs'!A58","v":"PC5500"},null,68.33,null,59.45]
[{"$f":"'Equipment Costs'!A59","v":"PC8000"},null,68.33,null,59.45]
[{"$f":"'Equipment Costs'!A60","v":"EX2500"},null,68.33,null,59.45]
[{"$f":"'Equipment Costs'!A61","v":"Hydraulic Hammers"}]
[{"$f":"'Equipment Costs'!A62","v":"H120Es (fits 325)"}]
[{"$f":"'Equipment Costs'!A63","v":"H160Es (fits 349)"}]
[{"$f":"'Equipment Costs'!A64","v":"H180Es (fits 374/390)"}]
[{"$f":"'Equipment Costs'!A65","v":"Demolition Shears"}]
[{"$f":"'Equipment Costs'!A66","v":"S3050 (fits 320/325/330)"}]
[{"$f":"'Equipment Costs'!A67","v":"S3070 (fits 330/349)"}]
[{"$f":"'Equipment Costs'!A68","v":"S3090 (fits 374/390)"}]
[{"$f":"'Equipment Costs'!A69","v":"Demolition Grapples"}]
[{"$f":"'Equipment Costs'!A70","v":"G315B (fits 320/325)"}]
[{"$f":"'Equipment Costs'!A71","v":"G320B (fits 325/330)"}]
[{"$f":"'Equipment Costs'!A72","v":"G330 (fits 349/374)"}]
[{"$f":"'Equipment Costs'!A73","v":"Other Equipment"}]
[{"$f":"'Equipment Costs'!A74","v":"420F2"},null,63.86,null,40.409999999999997]
[{"$f":"'Equipment Costs'!A75","v":"430F2"},null,63.86,null,40.409999999999997]
[{"$f":"'Equipment Costs'!A76","v":"CS54B"},null,63.86,null,40.409999999999997]
[{"$f":"'Equipment Costs'!A77","v":"CS64B"},null,63.86,null,40.409999999999997]
[{"$f":"'Equipment Costs'!A78","v":"CP54B"},null,63.86,null,40.409999999999997]
[{"$f":"'Equipment Costs'!A79","v":"CP68B"},null,63.86,null,40.409999999999997]
[{"$f":"'Equipment Costs'!A80","v":"Light Truck - 1.5 Ton"}]
[{"$f":"'Equipment Costs'!A81","v":"Supervisor's Truck"}]
[{"$f":"'Equipment Costs'!A82","v":"Flatbed Truck"}]
[{"$f":"'Equipment Costs'!A83","v":"Air Compressor + tools"}]
[{"$f":"'Equipment Costs'!A84","v":"Welding Equipment"}]
[{"$f":"'Equipment Costs'!A85","v":"Heavy Duty Drill Rig"}]
[{"$f":"'Equipment Costs'!A86","v":"Pump (plugging) Drill Rig"}]
[{"$f":"'Equipment Costs'!A87","v":"Concrete Pump"}]
[{"$f":"'Equipment Costs'!A88","v":"Gas Engine Vibrator"},null,63.13,null,39.79]
[{"$f":"'Equipment Costs'!A89","v":"Generator 5KW"}]
[{"$f":"'Equipment Costs'!A90","v":"HDEP Welder (pipe or liner)"}]
[{"$f":"'Equipment Costs'!A91","v":"5 Ton Crane"},null,69.760000000000005,null,42.54]
[{"$f":"'Equipment Costs'!A92","v":"20 Ton Crane"},null,69.760000000000005,null,42.54]
[{"$f":"'Equipment Costs'!A93","v":"50 Ton Crane"},null,66.06,null,42.54]
[{"$f":"'Equipment Costs'!A94","v":"120 Ton Crane"},null,68.19,null,45.77]
["Fringe Benefits"]
["Equip Op Fringe Benefits ($/hr)",null,0,null,0]
["Zone and Area Adjustments - Miles and Rates ($hr) (3)"]
["Equipment Zone 1","none",0,"none",0]
["Equipment Zone 2","camp",12,"camp",10.5]
["Equipment Zone 3"]
["Equipment Zone 4"]
["Equipment Zone 5"]
["Equipment Zone 6"]
["Equipment Zone 7"]
[]
["NOTES:"]
["(1) Equipment Type: ","Catepillar model or equivalent",null,"Catepillar model or equivalent",null,"Catepillar model or equivalent",null,"Catepillar model or equivalent",null,"Catepillar model or equivalent",null,"Catepillar model or equivalent",null,"Catepillar model or equivalent",null,"Catepillar model or equivalent",null,"Catepillar model or equivalent",null,"Catepillar model or equivalent",null,"Catepillar model or equivalent",null,"Catepillar model or equivalent",null,"Catepillar model or equivalent",null,"Catepillar model or equivalent",null,"Catepillar model or equivalent"]
["(2) Equipment Operator Source: ","XYZ Consulting",null,"Mine Site Costs","Mine Site Costs - R Butcher"]
["(3) Zone Basis: ","average camp living costs",null,"Mine Site Costs","Mine Site Costs - R Butcher"]
["TRUCK DRIVERS - Labor Groups and Base Pay Rate ($/hr) (4)"]
[{"$f":"'Equipment Costs'!A96","v":"725C"},null,63.13,null,39.71]
[{"$f":"'Equipment Costs'!A97","v":"730C"},null,63.13,null,39.71]
[{"$f":"'Equipment Costs'!A98","v":"735C"},null,63.13,null,39.71]
[{"$f":"'Equipment Costs'!A99","v":"740C"},null,63.13,null,39.71]
[{"$f":"'Equipment Costs'!A100","v":"770G"},null,63.13,null,39.71]
[{"$f":"'Equipment Costs'!A101","v":"773G"},null,63.13,null,39.71]
[{"$f":"'Equipment Costs'!A102","v":"777G"},null,63.86,null,40.409999999999997]
[{"$f":"'Equipment Costs'!A103","v":"785D"},null,63.86,null,40.409999999999997]
[{"$f":"'Equipment Costs'!A104","v":"789D"},null,63.86,null,40.409999999999997]
[{"$f":"'Equipment Costs'!A105","v":"793F"},null,63.86,null,40.409999999999997]
[{"$f":"'Equipment Costs'!A106","v":"797F"},null,63.86,null,40.409999999999997]
[{"$f":"'Equipment Costs'!A107","v":"613E (5,000 gal)"},null,63.86,null,40.409999999999997]
[{"$f":"'Equipment Costs'!A108","v":"621E (8,000 gal)"},null,63.86,null,40.409999999999997]
[{"$f":"'Equipment Costs'!A109","v":"777D H2O Truck"},null,63.86,null,40.409999999999997]
[{"$f":"'Equipment Costs'!A110","v":"785C H2O Truck"},null,63.86,null,40.409999999999997]
[{"$f":"'Equipment Costs'!A111","v":"Dump Truck (10-12 m3)"},null,63.13,null,39.71]
[{"$f":"'Equipment Costs'!A112","v":"Tractor/Trailer (18 ton)"},null,45.55,null,45.55]
[{"$f":"'Equipment Costs'!A113","v":"Tractor/Trailer (45 ton)"},null,45.55,null,45.55]
[{"$f":"'Equipment Costs'!A114","v":"Tractor/Trailer (75 ton)"},null,45.55,null,45.55]
["Fringe Benefits"]
["Truck Driver Fringe Benefits (cost/hr)",null,0,null,0]
["Zone and Area Adjustments (5)"]
["Truck Zone 1","none",0,"none",0]
["Truck Zone 2","camp",12,"camp",10.5]
["Truck Zone 3"]
["Truck Zone 4"]
["Truck Zone 5"]
["Truck Zone 6"]
["Truck Zone 7"]
[]
["NOTES:"]
["(4) Truck Driver Source: ","XYZ Consulting",null,"Mine Site Costs","Mine Site Costs - R Butcher"]
["(5) Zone Basis: ","average camp living costs",null,"Mine Site Costs","Mine Site Costs - R Butcher"]
["LABORERS - Labor Groups and Base Pay Rate ($/hr) (6,7)"]
["General Laborer",null,61.66,null,38.29]
["Skilled Laborer",null,63.86,null,40.409999999999997]
["Driller's Helper",null,61.66,null,38.29]
["Rodmen (reinforcing concrete)",null,67.53,null,43.95]
["Cement finisher",null,67.53,null,43.95]
["Carpenter",null,68.19,null,44.67]
["Fringe Benefits"]
["Laborer Fringe Benefits (cost/hr)"]
["Carpenter Fringe Benefits (cost/hr)"]
["Zone and Area Adjustments (8)"]
["Laborer Zone 1","none",0,"none",0]
["Laborer Zone 2","camp",12,"camp",10.5]
["Laborer Zone 3"]
["Laborer Zone 4"]
["Laborer Zone 5"]
["Laborer Zone 6"]
["Laborer Zone 7"]
[]
["NOTES:"]
["(6) Laborer Source: ","XYZ Consulting",null,"Mine Site Costs","Mine Site Costs - R Butcher"]
["(7) Carpenter Source: ","XYZ Consulting",null,"Mine Site Costs","Mine Site Costs - R Butcher"]
["(8) Zone Basis: ","average camp living costs",null,"Mine Site Costs","Mine Site Costs - R Butcher"]
["PROJECT MANAGEMENT AND TECHNICAL LABOR - Base Pay Rate ($/hr) (9)"]
["Project Manager",null,187.51,null,180.86]
["Foreman",null,96.6,null,93.17]
["Field Geologist/Engineer",null,176.15,null,169.9]
["Field Tech/Sampler",null,68.19,null,65.77]
["Range Scientist",null,170.46,null,164.42]
["Senior Planning Engineer",null,157.88,null,155.96]
["Project Engineer",null,115.78,null,114.37]
["Mechanic/Fitter",null,78.94,null,77.98]
[]
[]
[]
[]
[]
[]
[]
[]
[]
[]
[]
[]
["NOTES:"]
["(9) Project Manager:"]
["(9) Foreman Source:"]
["(9) Techical Labor Source:"]
["INDIRECT COSTS"]
["SOCIAL SECURITY, WORKMAN'S COMP, INSURANCE, ETC."]
["Unemployment (%)",null,1.8499999999999999E-2]
["Retirement/SS/Medicare (%)",null,1E-4]
["Workman's Compensation (%)",null,3.5000000000000003E-2]
["Total cost of benefits",null,5.5E-2]
[]
[]
[]
["NOTES:"]
["(10) Workman's Comp Source: ","Industry Average %",null,"Industry Average %"]

{"sheet":"Reclamation Material Costs","index":3,"n_rows":92,"n_cols":17,"rows_kept":92,"cut":false,"hidden":false,"merged":[[6,0,7,1],[0,1,0,2],[1,1,1,2],[2,1,2,2]]}
["File Name:",{"$f":"DataFileName","v":"SRCE_2.0_CostDataFile_USR_Example.xlsm"}]
["Date:",{"$f":"DataFileDate","v":"2008-09-29"}]
["Cost Basis:",{"$f":"DataCostBasis","v":"User Data"}]
["Author/Source:",{"$f":"AuthorSource","v":"AB Consulting"}]
[]
["RECLAMATION MATERIAL COST TABLE"]
["MATERIAL TYPE",null,"Basis 1","Basis 2","Basis 3","Basis 4","Basis 5","Basis 6","Basis 7","Basis 8","Basis 9","Basis 10","Basis 11","Basis 12","Basis 13","Basis 14","Basis 15"]
[null,null,{"$f":"IF(ISBLANK(VLOOKUP(C7,RegionNames,2,FALSE)),\"\",VLOOKUP(C7,RegionNames,2,FALSE))","v":"WA ARO"},"WA LOM - site costs","","","","","","","","","","","","",""]
["Revegetation Materials"]
["Seed Mixes"]
["Seed Mix","Units"]
["None"]
["Mix 1",{"$f":"IF(Metric,\"Cost/Ha\",\"Cost/Acre\")","v":"Cost/Ha"},696.3,1200]
["Mix 2","Cost/Ha",749.86]
["Mix 3","Cost/Ha",803.42]
["Mix 4","Cost/Ha",856.98,1570]
["User Mix 1","Cost/Ha"]
["User Mix 2","Cost/Ha"]
["User Mix 3","Cost/Ha"]
["User Mix 4","Cost/Ha"]
["User Mix 5 (see Seed Mix sheet)","Cost/Ha"]
[null,"Notes:","Range from AUS seeding contractors","Mine Site Costs"]
["Mulch"]
["Item","Units"]
["None"]
["Straw Mulch",{"$f":"IF(Metric,\"Cost/kg\",\"Cost/lb\")","v":"Cost/kg"},32.14,21.52]
["Hydro Mulch",{"$f":"IF(Metric,\"Cost/kg\",\"Cost/lb\")","v":"Cost/kg"},10.71,15.51]
["Timber Mulch",{"$f":"IF(Metric,\"Cost/kg\",\"Cost/lb\")","v":"Cost/kg"}]
[null,{"$f":"IF(Metric,\"Cost/kg\",\"Cost/lb\")","v":"Cost/kg"}]
[null,{"$f":"IF(Metric,\"Cost/kg\",\"Cost/lb\")","v":"Cost/kg"}]
[null,"Notes:"]
[]
[]
["Amendments"]
["Item","Units"]
["None"]
["Organic Matter",{"$f":"IF(Metric,\"Cost/kg\",\"Cost/lb\")","v":"Cost/kg"},0.27,0.26]
["Treated Sludge","Cost/kg",null,0.4]
["Chemical","Cost/kg",1.1200000000000001,1.1000000000000001]
[null,"Cost/kg"]
[null,{"$f":"IF(Metric,\"Cost/kg\",\"Cost/lb\")","v":"Cost/kg"}]
[null,"Cost/kg"]
[null,"Notes:","average of WA seeding contractors","Mine Site Costs"]
[]
[]
["Well Abandonment Materials"]
["Description","Units"]
[]
["Cement",{"$f":"IF(Metric,\"20kg bag\",\"50lb bag\")","v":"20kg bag"},7.66,7.66]
["Grout (Low Grade Bentonite)",{"$f":"IF(Metric,\"20kg bag\",\"50lb bag\")","v":"20kg bag"},38.28,36.28]
["Inert Material/Cuttings",{"$f":"IF(Metric,\"m3\",\"cy\")","v":"m3"},27,26]
[]
[]
[null,"Notes:",null,"Mine Site Costs - R Butcher"]
[]
[]
["Monitoring Costs"]
["Description","Units","Cost/unit","Cost/unit","Cost/unit","Cost/unit","Cost/unit","Cost/unit","Cost/unit","Cost/unit","Cost/unit","Cost/unit","Cost/unit","Cost/unit","Cost/unit","Cost/unit","Cost/unit"]
[]
["Monitor Well Pump","ea.",1467.22,1467.22]
["Sampling Supplies","ea.",43.63,43.63]
[]
["Water Analysis (Complete) (1)","ea.",486.21,486.21]
["ABA + S speciation","ea.",109.09,109.09]
["Cyanide - WAD","ea.",38.950000000000003,38.950000000000003]
["Cyanide - Free","ea.",32.729999999999997,32.729999999999997]
["Cyanide - Total soils","ea.",43.63,43.63]
["Cyanide - Total water","ea.",38.950000000000003]
["TPH in soils","ea.",77.92,77.92]
["Humidty Cell (20 wk) (2)","ea.",9887.85]
["Humidty Cell (40 wk)","ea.",19612.07]
["NAG","ea.",27.27,27.27]
["TCLP w/ full analysis","ea.",540.75,540.75]
["SPLP w/ full analysis","ea.",540.75,540.75]
["AS4439 Leach test w/ full analysis","ea.",540.75,540.75]
["Soil Fertility","ea.",163.63]
[null,"ea."]
[null,"Notes:",null,"Mine Site Costs"]
[]
[]
["Fuel, Etc."]
["Description","Units","Cost/unit","Cost/unit","Cost/unit","Cost/unit","Cost/unit","Cost/unit","Cost/unit","Cost/unit","Cost/unit","Cost/unit","Cost/unit","Cost/unit","Cost/unit","Cost/unit","Cost/unit"]
[]
["Off-road Diesel - delivered (1)",{"$f":"IF(Metric,\"Cost/litre\",\"Cost/gal\")","v":"Cost/litre"},0.8,0.71]
["Pickup Truck Travel",{"$f":"IF(Metric,\"Cost/km\",\"Cost/mi\")","v":"Cost/km"}]
["Electical Power","Cost/kWh",0.11,0.11]
[]
[]
[]
[]
[]
[null,"Notes:",null,"Mine Site Costs"]

{"sheet":"Misc. Unit Costs","index":4,"n_rows":190,"n_cols":32,"rows_kept":190,"cut":false,"hidden":false,"merged":[[189,28,189,29],[189,30,189,31],[189,20,189,21],[189,22,189,23],[189,24,189,25],[189,26,189,27],[189,16,189,17],[189,18,189,19],[2,1,2,2],[3,1,3,2],[7,0,8,1],[189,0,189,1],[189,2,189,3],[22,2,22,3],[23,2,23,3],[24,2,24,3],[189,4,189,5],[189,6,189,7],[189,8,189,9],[189,10,189,11],[189,12,189,13],[189,14,189,15],[22,0,22,1],[7,24,7,25],[7,22,7,23],[7,20,7,21],[7,18,7,19],[7,16,7,17],[7,14,7,15],[7,12,7,13],[7,10,7,11],[8,22,8,23],[8,24,8,25],[8,26,8,27],[8,28,8,29],[8,30,8,31],[7,30,7,31],[7,28,7,29],[7,26,7,27],[21,0,21,1],[8,2,8,3],[7,6,7,7],[21,4,21,5],[21,8,21,9],[21,10,21,11],[8,20,8,21],[8,8,8,9],[8,10,8,11],[8,12,8,13],[8,14,8,15],[8,16,8,17],[8,18,8,19],[7,4,7,5],[7,2,7,3],[8,4,8,5],[8,6,8,7],[7,8,7,9],[21,2,21,3],[22,4,22,5],[21,12,21,13],[21,14,21,15],[21,16,21,17],[21,6,21,7],[22,6,22,7],[23,4,23,5],[23,6,23,7],[22,12,22,13],[22,14,22,15],[23,8,23,9],[23,10,23,11],[23,12,23,13],[23,14,23,15],[22,8,22,9],[22,10,22,11],[22,16,22,17],[22,18,22,19],[22,20,22,21],[24,6,24,7],[21,18,21,19],[24,8,24,9],[24,10,24,11],[24,12,24,13],[24,14,24,15],[24,20,24,21],[24,16,24,17],[23,16,23,17],[22,30,22,31],[22,24,22,25],[22,26,22,27],[21,28,21,29],[21,30,21,31],[22,28,22,29],[22,22,22,23],[23,26,23,27],[24,18,24,19],[23,18,23,19],[24,30,24,31],[24,22,24,23],[23,28,23,29],[23,30,23,31],[24,24,24,25],[24,26,24,27],[24,28,24,29],[23,24,23,25],[23,22,23,23],[21,24,21,25],[21,26,21,27],[21,20,21,21],[21,22,21,23],[23,20,23,21],[95,0,95,1],[95,2,95,3],[95,4,95,5],[95,6,95,7],[95,8,95,9],[95,10,95,11],[54,2,54,3],[54,4,54,5],[54,6,54,7],[54,8,54,9],[55,2,55,3],[55,4,55,5],[55,6,55,7],[55,8,55,9],[55,10,55,11],[54,10,54,11],[63,2,63,3],[63,4,63,5],[63,6,63,7],[64,4,64,5],[71,2,71,3],[72,2,72,3],[72,4,72,5],[72,6,72,7],[23,0,23,1],[24,0,24,1],[24,4,24,5],[95,24,95,25],[55,14,55,15],[95,16,95,17],[78,12,78,13],[64,24,64,25],[71,22,71,23],[64,18,64,19],[64,20,64,21],[63,22,63,23],[95,12,95,13],[95,14,95,15],[55,16,55,17],[78,16,78,17],[78,18,78,19],[79,12,79,13],[79,14,79,15],[78,10,78,11],[55,12,55,13],[54,14,54,15],[63,16,63,17],[63,20,63,21],[96,0,96,1],[96,2,96,3],[96,4,96,5],[96,6,96,7],[151,20,151,21],[150,14,150,15],[150,0,150,1],[150,2,150,3],[150,4,150,5],[150,6,150,7],[96,18,96,19],[96,20,96,21],[96,16,96,17],[151,12,151,13],[151,18,151,19],[96,14,96,15],[96,12,96,13],[96,10,96,11],[96,8,96,9],[150,20,150,21],[150,8,150,9],[152,20,152,21],[152,26,152,27],[152,12,152,13],[152,14,152,15],[152,16,152,17],[152,18,152,19],[152,8,152,9],[151,0,151,1],[151,2,151,3],[152,10,152,11],[151,4,151,5],[151,6,151,7],[151,8,151,9],[151,10,151,11],[152,0,152,1],[152,4,152,5],[152,6,152,7],[151,24,151,25],[151,26,151,27],[151,28,151,29],[150,28,150,29],[150,30,150,31],[150,24,150,25],[150,26,150,27],[150,22,150,23],[152,30,152,31],[152,28,152,29],[152,22,152,23],[152,24,152,25],[63,18,63,19],[79,18,79,19],[54,30,54,31],[151,16,151,17],[151,14,151,15],[79,26,79,27],[79,28,79,29],[79,30,79,31],[55,30,55,31],[71,30,71,31],[72,30,72,31],[78,26,78,27],[54,28,54,29],[63,28,63,29],[78,30,78,31],[78,28,78,29],[96,30,96,31],[96,22,96,23],[96,24,96,25],[96,26,96,27],[96,28,96,29],[95,30,95,31],[151,30,151,31],[151,22,151,23],[95,28,95,29],[54,24,54,25],[54,26,54,27],[95,26,95,27],[63,30,63,31],[64,28,64,29],[71,28,71,29],[64,30,64,31],[72,26,72,27],[72,28,72,29],[55,28,55,29],[63,24,63,25],[71,26,71,27],[71,24,71,25],[55,24,55,25],[55,26,55,27],[63,26,63,27],[64,26,64,27],[54,18,54,19],[54,20,54,21],[54,22,54,23],[55,22,55,23],[150,10,150,11],[150,16,150,17],[150,18,150,19],[150,12,150,13],[95,22,95,23],[95,18,95,19],[95,20,95,21],[55,18,55,19],[54,16,54,17],[64,22,64,23],[64,16,64,17],[71,16,71,17],[71,18,71,19],[71,20,71,21],[72,10,72,11],[72,12,72,13],[72,14,72,15],[72,16,72,17],[55,20,55,21],[54,12,54,13],[71,14,71,15],[63,8,63,9],[63,10,63,11],[63,12,63,13],[64,2,64,3],[64,6,64,7],[71,4,71,5],[71,6,71,7],[71,8,71,9],[71,10,71,11],[64,8,64,9],[64,10,64,11],[64,12,64,13],[64,14,64,15],[71,12,71,13],[63,14,63,15],[72,8,72,9],[79,22,79,23],[79,24,79,25],[72,18,72,19],[72,20,72,21],[72,22,72,23],[72,24,72,25],[78,20,78,21],[79,10,79,11],[79,16,79,17],[79,2,79,3],[79,4,79,5],[79,6,79,7],[79,8,79,9],[79,20,79,21],[78,24,78,25],[78,22,78,23],[78,2,78,3],[78,4,78,5],[78,6,78,7],[78,8,78,9],[78,14,78,15]]}
[]
["File Name:",{"$f":"DataFileName","v":"SRCE_2.0_CostDataFile_USR_Example.xlsm"}]
["Date:",{"$f":"DataFileDate","v":"2008-09-29"}]
["Cost Basis:",{"$f":"DataCostBasis","v":"User Data"}]
["Author/Source:",{"$f":"AuthorSource","v":"AB Consulting"}]
[]
["MISCELLANEOUS COST TABLE"]
["JOB DESCRIPTION",null,"Basis 1",null,"Basis 2",null,"Basis 3",null,"Basis 4",null,"Basis 5",null,"Basis 6",null,"Basis 7",null,"Basis 8",null,"Basis 9",null,"Basis 10",null,"Basis 11",null,"Basis 12",null,"Basis 13",null,"Basis 14",null,"Basis 15"]
[null,null,{"$f":"IF(ISBLANK(VLOOKUP(C8,RegionNames,2,FALSE)),\"\",VLOOKUP(C8,RegionNames,2,FALSE))","v":"WA ARO"},null,{"$f":"IF(ISBLANK(VLOOKUP(E8,RegionNames,2,FALSE)),\"\",VLOOKUP(E8,RegionNames,2,FALSE))","v":"WA LOM - site costs"},null,{"$f":"IF(ISBLANK(VLOOKUP(G8,RegionNames,2,FALSE)),\"\",VLOOKUP(G8,RegionNames,2,FALSE))","v":""},null,{"$f":"IF(ISBLANK(VLOOKUP(I8,RegionNames,2,FALSE)),\"\",VLOOKUP(I8,RegionNames,2,FALSE))","v":""},null,{"$f":"IF(ISBLANK(VLOOKUP(K8,RegionNames,2,FALSE)),\"\",VLOOKUP(K8,RegionNames,2,FALSE))","v":""},null,{"$f":"IF(ISBLANK(VLOOKUP(M8,RegionNames,2,FALSE)),\"\",VLOOKUP(M8,RegionNames,2,FALSE))","v":""},null,{"$f":"IF(ISBLANK(VLOOKUP(O8,RegionNames,2,FALSE)),\"\",VLOOKUP(O8,RegionNames,2,FALSE))","v":""},null,{"$f":"IF(ISBLANK(VLOOKUP(Q8,RegionNames,2,FALSE)),\"\",VLOOKUP(Q8,RegionNames,2,FALSE))","v":""},null,{"$f":"IF(ISBLANK(VLOOKUP(S8,RegionNames,2,FALSE)),\"\",VLOOKUP(S8,RegionNames,2,FALSE))","v":""},null,{"$f":"IF(ISBLANK(VLOOKUP(U8,RegionNames,2,FALSE)),\"\",VLOOKUP(U8,RegionNames,2,FALSE))","v":""},null,{"$f":"IF(ISBLANK(VLOOKUP(W8,RegionNames,2,FALSE)),\"\",VLOOKUP(W8,RegionNames,2,FALSE))","v":""},null,{"$f":"IF(ISBLANK(VLOOKUP(Y8,RegionNames,2,FALSE)),\"\",VLOOKUP(Y8,RegionNames,2,FALSE))","v":""},null,{"$f":"IF(ISBLANK(VLOOKUP(AA8,RegionNames,2,FALSE)),\"\",VLOOKUP(AA8,RegionNames,2,FALSE))","v":""},null,{"$f":"IF(ISBLANK(VLOOKUP(AC8,RegionNames,2,FALSE)),\"\",VLOOKUP(AC8,RegionNames,2,FALSE))","v":""},null,{"$f":"IF(ISBLANK(VLOOKUP(AE8,RegionNames,2,FALSE)),\"\",VLOOKUP(AE8,RegionNames,2,FALSE))","v":""}]
["REVEGETATION"]
["Item","Units","Labor","Equip","Labor","Equip","Labor","Equip","Labor","Equip","Labor","Equip","Labor","Equip","Labor","Equip","Labor","Equip","Labor","Equip","Labor","Equip","Labor","Equip","Labor","Equip","Labor","Equip","Labor","Equip","Labor","Equip"]
["Seeding - Broadcast Manual (1)",{"$f":"IF(Metric,\"$/Ha\",\"$/acres\")","v":"$/Ha"},222.01329851743699,null,203.24754432630985]
["Seeding - Broadcast Mechanical (1)",{"$f":"IF(Metric,\"$/Ha\",\"$/acres\")","v":"$/Ha"},169.21013562680372,304.22789999999998,154.90758783789022,278.3775]
["Seeding - Drill (1)",{"$f":"IF(Metric,\"$/Ha\",\"$/acres\")","v":"$/Ha"}]
["Seeding - Hydroseeding (1)",{"$f":"IF(Metric,\"$/Ha\",\"$/acres\")","v":"$/Ha"},700,1400,640,1200]
["Item","Units","Materials",null,"Materials",null,"Materials",null,"Materials",null,"Materials",null,"Materials",null,"Materials",null,"Materials",null,"Materials",null,"Materials",null,"Materials",null,"Materials",null,"Materials",null,"Materials",null,"Materials"]
["Shrub Planting - bare root 6-10 in (150- 250mm) (2)","ea.",12,null,8]
["Tree Planting - bare root 11-16 in (270- 400mm) (3)","ea.",17.5,null,8.5]
["Cactus Planting (4)","ea."]
[]
["NOTES:"]
["(1) Seeding Source: ","(1) Seeding Source: ","Granite Seed"]
["(2) Shrub Source: ","(2) Shrub Source: ","Various"]
["(3) Tree Source: ","(3) Tree Source: ","Various"]
["(4) Cactus Source: ","(4) Cactus Source: ","Not in Australia"]
["BUILDING and WALL DEMOLITION"]
["Item","Units",null,"Premium",null,"Premium",null,"Premium",null,"Premium",null,"Premium",null,"Premium",null,"Premium",null,"Premium",null,"Premium",null,"Premium",null,"Premium",null,"Premium",null,"Premium",null,"Premium",null,"Premium"]
["Building Demolition"]
["Lg. steel",{"$f":"IF(Metric,\"m3\",\"C.F.\")","v":"m3"}]
["Lg. concrete","m3"]
["Lg. masonry","m3"]
["Lg. mixed","m3"]
["Sm. steel","m3"]
["Sm. concrete","m3"]
["Sm. masonry","m3"]
["Sm. wood","m3"]
["Wall Demolition"]
[{"$f":"IF(Metric,\"Block 100 mm thick\",\"Block 4 in thick\")","v":"Block 100 mm thick"},{"$f":"IF(Metric,\"m2\",\"S.F.\")","v":"m2"},null,0.2,null,0.2,null,0.2,null,0.2,null,0.2,null,0.2,null,null,null,0.2,null,0.2,null,null,null,0.2,null,null,null,0.2,null,null,null,0.2]
[{"$f":"IF(Metric,\"Block 150 mm thick\",\"Block 6 in thick\")","v":"Block 150 mm thick"},"m2",null,0.2,null,0.2,null,0.2,null,0.2,null,0.2,null,0.2,null,null,null,0.2,null,0.2,null,null,null,0.2,null,null,null,0.2,null,null,null,0.2]
[{"$f":"IF(Metric,\"Block 200 mm thick\",\"Block 8 in thick\")","v":"Block 200 mm thick"},"m2",null,0.2,null,0.2,null,0.2,null,0.2,null,0.2,null,0.2,null,null,null,0.2,null,0.2,null,null,null,0.2,null,null,null,0.2,null,null,null,0.2]
[{"$f":"IF(Metric,\"Block 300 mm thick\",\"Block 12 in thick\")","v":"Block 300 mm thick"},"m2",null,0.2,null,0.2,null,0.2,null,0.2,null,0.2,null,0.2,null,null,null,0.2,null,0.2,null,null,null,0.2,null,null,null,0.2,null,null,null,0.2]
[{"$f":"IF(Metric,\"Conc 150 mm thick\",\"Conc 6 in thick\")","v":"Conc 150 mm thick"},"m2",null,0.1,null,0.1,null,0.1,null,0.1,null,0.1,null,0.1,null,null,null,0.1,null,0.1,null,null,null,0.1,null,null,null,0.1,null,null,null,0.1]
[{"$f":"IF(Metric,\"Conc 200 mm thick\",\"Conc 8 in thick\")","v":"Conc 200 mm thick"},"m2",null,0.1,null,0.1,null,0.1,null,0.1,null,0.1,null,0.1,null,null,null,0.1,null,0.1,null,null,null,0.1,null,null,null,0.1,null,null,null,0.1]
[{"$f":"IF(Metric,\"Conc 250 mm thick\",\"Conc 10 in thick\")","v":"Conc 250 mm thick"},"m2",null,0.1,null,0.1,null,0.1,null,0.1,null,0.1,null,0.1,null,null,null,0.1,null,0.1,null,null,null,0.1,null,null,null,0.1,null,null,null,0.1]
[{"$f":"IF(Metric,\"Conc 300 mm thick\",\"Conc 12 in thick\")","v":"Conc 300 mm thick"},"m2",null,0.1,null,0.1,null,0.1,null,0.1,null,0.1,null,0.1,null,null,null,0.1,null,0.1,null,null,null,0.1,null,null,null,0.1,null,null,null,0.1]
["WASTE DISPOSAL"]
["Item","Units","Materials",null,"Materials",null,"Materials",null,"Materials",null,"Materials",null,"Materials",null,"Materials",null,"Materials",null,"Materials",null,"Materials","Premium","Materials",null,"Materials",null,"Materials",null,"Materials",null,"Materials"]
["Rubbish and Waste Handling"]
["Dumpster delivery (average for all sizes)","ea.",180.56,null,180.56]
["Haul (average for all sizes)","ea.",180.56,null,180.56]
["Rent per month (average for all sizes)","ea.",400,null,400]
["Disposal fee per ton (tonne) (average for all sizes)",{"$f":"IF(Metric,\"tonne\",\"ton\")","v":"tonne"},75,null,88.379429559204837]
[]
["NOTES:"]
[null,"Dumpster Cost Source","John's HazMat",null,"Varies by location"]
[null,"Disposal Fee Source:","Varies greatly by authority, distance and contaminiation",null,"Varies greatly by authority, distance and contaminiation"]
["Hazardous Material Handling - Solids"]
["Pickup fees 55 gal. drums","ea.",6.42,null,6.42]
["Bulk material (average)",{"$f":"IF(Metric,\"tonne\",\"ton\")","v":"tonne"},355,null,355]
["Transport - truck load (80 drums, 25 cy (m3), 18 tons)",{"$f":"IF(Metric,\"km\",\"mile\")","v":"km"},3.6,null,3.6]
["Dump site disposal fee",{"$f":"IF(Metric,\"tonne\",\"ton\")","v":"tonne"},160,null,200]
[]
["NOTES:"]
[null,"Solid Handling Cost Source","John's HazMat",null,"Varies by location"]
[null,"Solid Disposal Fee Source:","Varies greatly by authority, distance and contaminiation",null,"Varies greatly by authority, distance and contaminiation"]
["Hazardous Material Handling - Liquids"]
["Vacuum Truck Pickup (2200 gal or 9,700 litres)","hr.",190,null,190]
["Vacuum Truck Pickup (5000 gal or 2,000 litres)","hr.",310,null,310]
["Dump site disposal fee",{"$f":"IF(Metric,\"tonne\",\"ton\")","v":"tonne"},170,null,135]
[]
["NOTES:"]
[null,"Liquid Handling Cost Source","John's HazMat",null,"Varies by location"]
[null,"Liquid Disposal Fee Source:","Varies greatly by authority, distance and contaminiation",null,"Varies greatly by authority, distance and contaminiation"]
["Hydrocarbon Contaminated Soils (HCS)"]
["Insitu Biotreatment",{"$f":"IF(Metric,\"m3\",\"C.Y\")","v":"m3"},45,null,40]
["HCS disposal fee",{"$f":"IF(Metric,\"m3\",\"C.Y\")","v":"m3"},160,null,200]
[]
["NOTES:"]
[null,"Insitu Treatement Cost Source","Varies by location",null,"Varies by location"]
[null,"HCS Disposal Fee Source:","Varies greatly by authority, distance and contaminiation",null,"Varies greatly by authority, distance and contaminiation"]
["UNDERGROUND OPENING CLOSURE"]
["Item","Units","Materials","Premium","Materials","Premium","Materials","Premium","Materials","Premium","Materials","Premium","Materials","Premium","Materials","Premium","Materials","Premium","Materials","Premium","Materials","Premium","Materials","Premium","Materials","Premium","Materials","Premium","Materials","Premium","Materials","Premium"]
["Reinforced Concrete Bulkheads and Shaft Covers"]
[{"$f":"IF(Metric,\"Grade walls - 400 mm thick, 2.5 m high\",\"Grade walls - 15 in thick, 8 ft high\")","v":"Grade walls - 400 mm thick, 2.5 m high"},{"$f":"IF(Metric,\"m3\",\"C.Y\")","v":"m3"},2105.0041017227236,null,2050.5159896283499]
[{"$f":"IF(Metric,\"Grade walls - 400 mm thick, 4.5 m high\",\"Grade walls - 15 in thick, 12 ft high\")","v":"Grade walls - 400 mm thick, 4.5 m high"},{"$f":"IF(Metric,\"m3\",\"C.Y\")","v":"m3"},2420.7547169811323,null,2191.4433880726001]
[{"$f":"CONCATENATE(\"Elevated conc, 1-way beam & slab - \" & IF(Metric,\"4.5m span\",\"15ft span\"))","v":"Elevated conc, 1-way beam & slab - 4.5m span"},{"$f":"IF(Metric,\"m3\",\"C.Y\")","v":"m3"},3157.5061525840902,null,2919.27398444252]
[{"$f":"CONCATENATE(\"Elevated conc, 1-way beam & slab - \" & IF(Metric,\"7.5m span\",\"25ft span\"))","v":"Elevated conc, 1-way beam & slab - 7.5m span"},{"$f":"IF(Metric,\"m3\",\"C.Y\")","v":"m3"},3683.7571780147664,null,3439.1529818496101]
["Item","Units","Materials",null,"Materials",null,"Materials",null,"Materials",null,"Materials",null,"Materials",null,"Materials",null,"Materials",null,"Materials",null,"Materials",null,"Materials",null,"Materials",null,"Materials",null,"Materials",null,"Materials"]
["Small Adit Plugging"]
["Bat Gate (5)","ea.",6315.0123051681712,null,6038.5479688850501]
["Culvert Gate (5)",{"$f":"IF(Metric,\"m3\",\"C.Y\")","v":"m3"},2105.0041017227236,null,2049.5159896283499]
["Adit Foam Plug (6)",{"$f":"IF(Metric,\"m3\",\"C.Y\")","v":"m3"},526.2510254306809,null,503.87899740708701]
["Production Opening Foam Plug (6)",{"$f":"IF(Metric,\"m3\",\"C.Y\")","v":"m3"},315.75061525840857,null,281.92739844425199]
[]
["NOTES:"]
["(5) Bat Gate Source: ",null,"Concrete Works-Rawlinsons Construction hanbook"]
["(6) Foam Plug Source: "]
["MISC. LINEAR PROJECTS"]
["Item","Units","Materials","Premium","Materials","Premium","Materials","Premium","Materials","Premium","Materials","Premium","Materials","Premium","Materials","Premium","Materials","Premium","Materials","Premium","Materials","Premium","Materials","Premium","Materials","Premium","Materials","Premium","Materials","Premium","Materials","Premium"]
["Fencing Installation"]
["Barbed 3-strand",{"$f":"IF(Metric,\"m\",\"ft\")","v":"m"},1.8945036915504514,null,1.8715643906655144]
["Barbed 4-strand","m",2.5260049220672682,null,2.495419187554019]
["Barbed 5-strand","m",3.6837571780147664,null,3.6391529818496111]
[{"$f":"CONCATENATE(\"Chain link \"&IF(Metric,\"2.5 m - 3.0 m\",\"8 ft -10 ft\")&\" Install\")","v":"Chain link 2.5 m - 3.0 m Install"},"m",161.03281378178835,null,75]
[{"$f":"CONCATENATE(\"Wood stockade fence \"&IF(Metric,\"2 m\",\"6 ft\")&\" high - Install\")","v":"Wood stockade fence 2 m high - Install"},"m",205.23789991796556,null,100]
[null,"m"]
[null,"m"]
[]
[]
["Fencing Removal"]
["Barbed 3-strand Removal",{"$f":"IF(Metric,\"m\",\"ft\")","v":"m"},1.0525020508613618,null,1.0397579948141746]
["Barbed 4-strand Removal","m",1.3682526661197705,null,1.3516853932584272]
["Barbed 5-strand Removal","m",1.6840032813781791,null,1.6636127917026795]
[{"$f":"CONCATENATE(\"Chain link \" & IF(Metric,\"2.5 m - 3.0 m\",\"8 ft -10 ft\") & \" Removal\")","v":"Chain link 2.5 m - 3.0 m Removal"},"m",52.625102543068095,null,39]
[{"$f":"CONCATENATE(\"Wood, all types \" & IF(Metric,\"1.5 m - 2.0 m\",\"4 ft -6 ft high\") & \" Removal\")","v":"Wood, all types 1.5 m - 2.0 m Removal"},"m",47.362592288761284,null,35]
[null,"m"]
[null,"m"]
[]
[]
["Culvert Removal"]
["12 in (300 mm ) Diameter",{"$f":"IF(Metric,\"m\",\"ft\")","v":"m"},8.1999999999999993,null,8.1999999999999993]
["18 in (450 mm) Diameter",{"$f":"IF(Metric,\"m\",\"ft\")","v":"m"},9.3699999999999992,null,9.3699999999999992]
["24 in (600 mm) Diameter",{"$f":"IF(Metric,\"m\",\"ft\")","v":"m"},10.94,null,10.94]
["36 in (1m) Diameter",{"$f":"IF(Metric,\"m\",\"ft\")","v":"m"},13.12,null,13.12]
["Pipeline Removal"]
["Plastic Pipe 3/4 in (mm) - 4 in (100 mm) diameter",{"$f":"IF(Metric,\"m\",\"ft\")","v":"m"},5.0599999999999996,null,5.0599999999999996]
["6 in (150 mm) - 8 in (200 mm)",{"$f":"IF(Metric,\"m\",\"ft\")","v":"m"},5.7,null,5.7]
["10 in (250 mm) - 18 in (450 mm)",{"$f":"IF(Metric,\"m\",\"ft\")","v":"m"},6.5,null,6.5]
["20 in (500 mm) - 36 in (1 m)",{"$f":"IF(Metric,\"m\",\"ft\")","v":"m"},7.6,null,7.6]
["Pipe and Drainpipe Installation"]
["Water 4in (100mm ) 40ft (12m) length, welded HDPE",{"$f":"IF(Metric,\"m\",\"ft\")","v":"m"},63.22,null,63.22]
["Water 6in (150mm) 40ft (12m) length, welded HDPE","m",81,null,81]
["Water 12in (300mm) 40ft (12m) length, welded HDPE","m",169.38,null,169.38]
["Drain 4in (100mm) perforated PVC","m",83.49,null,83.49]
["Drain 6in (150mm) perforated PVC","m",101.62,null,101.62]
["Drain 4in (100mm) corrugated, perf or plain","m",83.49,null,83.49]
["Drain 6in (150mm) corrugated., perf or plain","m",106.03,null,106.03]
["Drain Rock Preparation"]
["Item","Units",null,"Total",null,"Total",null,"Total",null,"Total",null,"Total",null,"Total",null,"Total",null,"Total",null,"Total",null,"Total",null,"Total",null,"Total",null,"Total",null,"Total",null,"Total"]
["Crushing",{"$f":"IF(Metric,\"m3\",\"C.Y\")","v":"m3"},null,15.75,null,15.75]
["Screening",{"$f":"IF(Metric,\"m3\",\"C.Y\")","v":"m3"},null,8.4,null,8.4]
["Misc."]
["Item","Units",null,"Premium",null,"Premium",null,"Premium",null,"Premium",null,"Premium",null,"Premium",null,"Premium",null,"Premium",null,"Premium",null,"Premium",null,"Premium",null,"Premium",null,"Premium",null,"Premium",null,"Premium"]
["Backhoe work",{"$f":"IF(Metric,\"m3\",\"C.Y\")","v":"m3"}]
["Powerline and Transformer Removal",null,null,"Total",null,"Total",null,"Total",null,"Total",null,"Total",null,"Total",null,"Total",null,"Total",null,"Total",null,"Total",null,"Total",null,"Total",null,"Total",null,"Total",null,"Total"]
["Single Pole Powerlines (7)",{"$f":"IF(Metric,\"km\",\"mile\")","v":"km"},null,11000,null,11000]
["Double Pole Powerlines (8)",{"$f":"IF(Metric,\"km\",\"mile\")","v":"km"},null,17500,null,17500]
["Substation (9)","unit",null,27500,null,27500]
[]
["NOTES:"]
["(7) Single Pole Source: "]
["(8) Double Pole Source: "]
["(9) Transformer Source: "]
["EROSION, EVAPORATION and SEDIMENTATION CONTROL"]
["Item","Units","Materials","Premium","Materials","Premium","Materials","Premium","Materials","Premium","Materials","Premium","Materials","Premium","Materials","Premium","Materials","Premium","Materials","Premium","Materials","Premium","Materials","Premium","Materials","Premium","Materials","Premium","Materials","Premium","Materials","Premium"]
["Rip-Rap & Rock Lining"]
["Rip-Rap 3/8 to 1/4 CY (m3) pieces, grouted",{"$f":"IF(Metric,\"m2\",\"S.Y.\")","v":"m2"},25.1,2,25.1,2]
["Rip-Rap 18 in (450 mm) min thick, no grout","m2",45.18,2,45.18,2]
["Gabions, 6 in (150 mm) deep","m2",26.25,0.15,26.25,0.15]
["Gabions, 9 in (250 mm) deep","m2",41.1,0.15,41.1,0.15]
["Gabions, 12 in (300 mm) deep","m2",44.69,0.18,44.69,0.18]
["Gabions, 18 in (450 mm) deep","m2",59.11,0.25,59.11,0.25]
["Gabions, 36 in (1m) deep","m2",108.94,0.6,108.94,0.6]
["Liner Installation"]
["Item","Units","Materials","Premium","Materials","Premium","Materials","Premium","Materials","Premium","Materials","Premium","Materials","Premium","Materials","Premium","Materials","Premium","Materials","Premium","Materials","Premium","Materials","Premium","Materials","Premium","Materials","Premium","Materials","Premium","Materials","Premium"]
["Finish grading large area",{"$f":"IF(Metric,\"m2\",\"S.F.\")","v":"m2"}]
["Compaction-riding, vibrating roller - 12in (300mm) lifts","m2",0.28999999999999998,1.25,0.28999999999999998,1.25]
["Geotextile","m2",0.94,1.25,0.94,1.25]
["Geonet","m2"]
["Geogrid","m2"]
["60 mil HDPE","m2",11.69,null,9.69]
["Transport Costs"]
["Item","Units",null,"Total",null,"Total",null,"Total",null,"Total",null,"Total",null,"Total",null,"Total",null,"Total",null,"Total",null,"Total",null,"Total",null,"Total",null,"Total",null,"Total",null,"Total"]
["Ship/Barge Transport Cost",{"$f":"\"Cost/ton\"","v":"Cost/ton"},null,1.65,null,1.65]
["Rail Transport Cost",{"$f":"\"Cost/ton\"","v":"Cost/ton"},null,2.1,null,2.1]
["Air Transport Cost","Cost/ton",null,4.5,null,4.5]
["Escort Vehicle Deadhead Rate",{"$f":"\"Cost/\"&IF(Metric,\"km\",\"mi\")","v":"Cost/km"},null,0.5,null,0.5]
["Construction Management Support"]
["Item","Units",null,"Materials",null,"Materials",null,"Materials",null,"Materials",null,"Materials",null,"Materials",null,"Materials",null,"Materials",null,"Materials",null,"Materials",null,"Materials",null,"Materials",null,"Materials",null,"Materials",null,"Materials"]
["Office Trailer, Furnished, no hook-ups","month",null,625,null,625]
["Toilet Portable, chemical","month",null,315,null,315]
[]
["PRODUCTION OR DEWATERING WELL PUMP REMOVAL"]
["Item","Units","Labor","Equip","Labor","Equip","Labor","Equip","Labor","Equip","Labor","Equip","Labor","Equip","Labor","Equip","Labor","Equip","Labor","Equip","Labor","Equip","Labor","Equip","Labor","Equip","Labor","Equip","Labor","Equip","Labor","Equip"]
["Pump Type"]
["Submersible (10)",{"$f":"IF(Metric,\"m to pump\",\"ft to pump\")","v":"m to pump"},4.34,7.26,4.34,7.26]
["Line Shaft (10)",{"$f":"IF(Metric,\"m to pump\",\"ft to pump\")","v":"m to pump"},8.73,16.95,8.73,16.95]
[]
["NOTES:"]
["(10) Pump Removal Source: "]

{"sheet":"Indirect Costs","index":5,"n_rows":24,"n_cols":6,"rows_kept":24,"cut":false,"hidden":true,"merged":[[7,1,7,5],[22,0,22,4],[0,1,0,2],[1,1,1,2],[2,1,2,2]]}
["File Name:","CostData STD 3.xls"]
["Date:","2005-12-01"]
["Cost Basis:","Standardized Data"]
["Author/Source:",{"$f":"AuthorSource","v":"AB Consulting"}]
[]
[]
["Administrative Cost Rates (%)"]
[null,"Cost Ranges for Indirect Cost Percentages"]
[null,"<=","<=","<=",">"]
["1. Engineering, Design and Construction (ED&C) Plan (7)",500000,2500000,25000000,25000000,"Small Plan"]
["Variable Rate"]
[null,"<=","<=","<=",">"]
["2. Contingency (8)",500000,5000000,50000000,50000000,"Small Plan"]
["Variable Rate",0.03,0.04,0.05,0.06,0.02]
["3. Insurance (9)",1.4999999999999999E-2,"of labor costs"]
["4. Bond (10)",0.03,"of the O&M costs if O&M costs are >$100,000"]
["5. Contractor Profit (11)",0.1,"of the O&M costs"]
[null,"<=","<=","<=",">"]
["6. Contract Administration (12)",1000000,15000000,25000000,25000000]
["Variable Rate"]
[]
[]
["RECLAMATION COST ESTIMATION SUMMARY SHEET FOOTNOTES"]
["NOTE : Cost can vary considerably from site to site due to remote location of Australian Mine sites"]